[Geoserver-devel] Build failed in Jenkins: geoserver-2.5.x #130

See <http://ares.opengeo.org/jenkins/job/geoserver-2.5.x/130/changes&gt;

Changes:

[maurobartolomeoli] GEOS-6711: improvements for the authkey module, by mapper parameters and

[maurobartolomeoli] GEOS-6711: added some documentation for the improvements

------------------------------------------
[...truncated 3509 lines...]
Tests run: 1, Failures: 0, Errors: 0, Skipped: 0, Time elapsed: 1.885 sec
Running org.geoserver.security.password.URLMasterPasswordProviderTest
Tests run: 1, Failures: 0, Errors: 0, Skipped: 0, Time elapsed: 1.129 sec
Running org.geoserver.security.rememberme.RememberMeTest
Tests run: 2, Failures: 0, Errors: 0, Skipped: 0, Time elapsed: 1.784 sec
Running org.geoserver.security.validation.FilterConfigValidatorTest
Tests run: 8, Failures: 0, Errors: 0, Skipped: 0, Time elapsed: 0.023 sec
Running org.geoserver.security.validation.MasterPasswordChangeValidatorTest
Tests run: 2, Failures: 0, Errors: 0, Skipped: 0, Time elapsed: 0.021 sec
Running org.geoserver.security.validation.PasswordValidatorTest
Tests run: 1, Failures: 0, Errors: 0, Skipped: 0, Time elapsed: 0.005 sec
Running org.geoserver.security.validation.RoleStoreValidationWrapperTest
Tests run: 4, Failures: 0, Errors: 0, Skipped: 0, Time elapsed: 0.036 sec
Running org.geoserver.security.validation.SecurityConfigValidatorTest
Tests run: 6, Failures: 0, Errors: 0, Skipped: 0, Time elapsed: 1.324 sec
Running org.geoserver.security.validation.UserGroupStoreValidationWrapperTest
Tests run: 1, Failures: 0, Errors: 0, Skipped: 0, Time elapsed: 1.187 sec
Running org.geoserver.security.xml.XMLRoleServiceTest
Tests run: 8, Failures: 0, Errors: 0, Skipped: 0, Time elapsed: 3.269 sec
Running org.geoserver.security.xml.XMLSecurityConfigValidatorTest
Tests run: 6, Failures: 0, Errors: 0, Skipped: 0, Time elapsed: 1.337 sec
Running org.geoserver.security.xml.XMLUserDetailsServiceTest
Tests run: 4, Failures: 0, Errors: 0, Skipped: 0, Time elapsed: 4.417 sec
Running org.geoserver.security.xml.XMLUserGroupServiceTest
Tests run: 11, Failures: 0, Errors: 0, Skipped: 0, Time elapsed: 6.925 sec
Running org.geoserver.template.DirectFeatureWrapperTest
Tests run: 4, Failures: 0, Errors: 0, Skipped: 0, Time elapsed: 0.282 sec
Running org.geoserver.template.FeatureWrapperTest
Tests run: 4, Failures: 0, Errors: 0, Skipped: 0, Time elapsed: 0.015 sec
Running org.geoserver.template.GeoServerTemplateLoader2Test
Tests run: 5, Failures: 0, Errors: 0, Skipped: 0, Time elapsed: 0.044 sec
Running org.geoserver.threadlocals.AdminRequestThreadLocalTransferTest
Tests run: 1, Failures: 0, Errors: 0, Skipped: 0, Time elapsed: 0.004 sec
Running org.geoserver.threadlocals.AuthenticationThreadLocalTransferTest
Tests run: 1, Failures: 0, Errors: 0, Skipped: 0, Time elapsed: 0.007 sec
Running org.geoserver.threadlocals.LocalLayerThreadLocalTransferTest
Tests run: 1, Failures: 0, Errors: 0, Skipped: 0, Time elapsed: 0.009 sec
Running org.geoserver.threadlocals.LocalWorkspaceThreadLocalTransferTest
Tests run: 1, Failures: 0, Errors: 0, Skipped: 0, Time elapsed: 0 sec
Running org.geoserver.threadlocals.PublicThreadLocalTransferTest
Tests run: 1, Failures: 0, Errors: 0, Skipped: 0, Time elapsed: 0.014 sec
Running org.geoserver.threadlocals.ThreadLocalsTransferTest
Tests run: 1, Failures: 0, Errors: 0, Skipped: 0, Time elapsed: 1.533 sec
Running org.geoserver.util.PartialBufferOutputStream2Test
Tests run: 1, Failures: 0, Errors: 0, Skipped: 0, Time elapsed: 0 sec
Running org.geoserver.util.XCQLTest
Tests run: 2, Failures: 0, Errors: 0, Skipped: 0, Time elapsed: 0.029 sec
Running org.geoserver.vfny.global.TolerantStartupTest
Tests run: 1, Failures: 0, Errors: 0, Skipped: 0, Time elapsed: 1.551 sec
Running org.vfny.geoserver.ProjectionPolicyTest
Tests run: 5, Failures: 0, Errors: 0, Skipped: 0, Time elapsed: 2.033 sec
Running org.vfny.geoserver.crs.OverrideCRSTest
Tests run: 1, Failures: 0, Errors: 0, Skipped: 0, Time elapsed: 1.626 sec
Running org.vfny.geoserver.crs.OvverideTransformationsTest
Tests run: 4, Failures: 0, Errors: 1, Skipped: 0, Time elapsed: 1.624 sec <<< FAILURE!
testNadCon(org.vfny.geoserver.crs.OvverideTransformationsTest) Time elapsed: 11 sec <<< ERROR!
org.opengis.referencing.FactoryException: Database failure while creating a 'CoordinateReferenceSystem' object for code "EPSG:4138".
  at org.geotools.referencing.factory.epsg.DirectEpsgFactory.databaseFailure(DirectEpsgFactory.java:3009)
  at org.geotools.referencing.factory.epsg.DirectEpsgFactory.createCoordinateReferenceSystem(DirectEpsgFactory.java:2046)
  at org.geotools.referencing.factory.BufferedAuthorityFactory.createCoordinateReferenceSystem(BufferedAuthorityFactory.java:783)
  at org.geotools.referencing.factory.AuthorityFactoryAdapter.createCoordinateReferenceSystem(AuthorityFactoryAdapter.java:801)
  at org.geotools.referencing.factory.BufferedAuthorityFactory.createCoordinateReferenceSystem(BufferedAuthorityFactory.java:783)
  at org.geotools.referencing.factory.AuthorityFactoryAdapter.createCoordinateReferenceSystem(AuthorityFactoryAdapter.java:801)
  at org.geotools.referencing.factory.FallbackAuthorityFactory.createCoordinateReferenceSystem(FallbackAuthorityFactory.java:640)
  at org.geotools.referencing.factory.FallbackAuthorityFactory.createCoordinateReferenceSystem(FallbackAuthorityFactory.java:644)
  at org.geotools.referencing.factory.AuthorityFactoryAdapter.createCoordinateReferenceSystem(AuthorityFactoryAdapter.java:801)
  at org.geotools.referencing.factory.ThreadedAuthorityFactory.createCoordinateReferenceSystem(ThreadedAuthorityFactory.java:731)
  at org.geotools.referencing.DefaultAuthorityFactory.createCoordinateReferenceSystem(DefaultAuthorityFactory.java:179)
  at org.geotools.referencing.CRS.decode(CRS.java:519)
  at org.geotools.referencing.CRS.decode(CRS.java:447)
  at org.vfny.geoserver.crs.OvverideTransformationsTest.testNadCon(OvverideTransformationsTest.java:106)
  at sun.reflect.NativeMethodAccessorImpl.invoke0(Native Method)
  at sun.reflect.NativeMethodAccessorImpl.invoke(NativeMethodAccessorImpl.java:39)
  at sun.reflect.DelegatingMethodAccessorImpl.invoke(DelegatingMethodAccessorImpl.java:25)
  at java.lang.reflect.Method.invoke(Method.java:597)
  at org.junit.runners.model.FrameworkMethod$1.runReflectiveCall(FrameworkMethod.java:47)
  at org.junit.internal.runners.model.ReflectiveCallable.run(ReflectiveCallable.java:12)
  at org.junit.runners.model.FrameworkMethod.invokeExplosively(FrameworkMethod.java:44)
  at org.junit.internal.runners.statements.InvokeMethod.evaluate(InvokeMethod.java:17)
  at org.junit.internal.runners.statements.RunBefores.evaluate(RunBefores.java:26)
  at org.junit.internal.runners.statements.RunAfters.evaluate(RunAfters.java:27)
  at org.junit.rules.RunRules.evaluate(RunRules.java:20)
  at org.junit.runners.ParentRunner.runLeaf(ParentRunner.java:271)
  at org.junit.runners.BlockJUnit4ClassRunner.runChild(BlockJUnit4ClassRunner.java:70)
  at org.junit.runners.BlockJUnit4ClassRunner.runChild(BlockJUnit4ClassRunner.java:50)
  at org.junit.runners.ParentRunner$3.run(ParentRunner.java:238)
  at org.junit.runners.ParentRunner$1.schedule(ParentRunner.java:63)
  at org.junit.runners.ParentRunner.runChildren(ParentRunner.java:236)
  at org.junit.runners.ParentRunner.access$000(ParentRunner.java:53)
  at org.junit.runners.ParentRunner$2.evaluate(ParentRunner.java:229)
  at org.junit.internal.runners.statements.RunBefores.evaluate(RunBefores.java:26)
  at org.junit.internal.runners.statements.RunAfters.evaluate(RunAfters.java:27)
  at org.junit.runners.ParentRunner.run(ParentRunner.java:309)
  at org.apache.maven.surefire.junit4.JUnit4Provider.execute(JUnit4Provider.java:252)
  at org.apache.maven.surefire.junit4.JUnit4Provider.executeTestSet(JUnit4Provider.java:141)
  at org.apache.maven.surefire.junit4.JUnit4Provider.invoke(JUnit4Provider.java:112)
  at sun.reflect.NativeMethodAccessorImpl.invoke0(Native Method)
  at sun.reflect.NativeMethodAccessorImpl.invoke(NativeMethodAccessorImpl.java:39)
  at sun.reflect.DelegatingMethodAccessorImpl.invoke(DelegatingMethodAccessorImpl.java:25)
  at java.lang.reflect.Method.invoke(Method.java:597)
  at org.apache.maven.surefire.util.ReflectionUtils.invokeMethodWithArray(ReflectionUtils.java:189)
  at org.apache.maven.surefire.booter.ProviderFactory$ProviderProxy.invoke(ProviderFactory.java:165)
  at org.apache.maven.surefire.booter.ProviderFactory.invokeProvider(ProviderFactory.java:85)
  at org.apache.maven.surefire.booter.ForkedBooter.runSuitesInProcess(ForkedBooter.java:115)
  at org.apache.maven.surefire.booter.ForkedBooter.main(ForkedBooter.java:75)
Caused by: java.sql.SQLException: Database lock acquisition failure: attempt to connect while db opening /closing
  at org.hsqldb.jdbc.Util.sqlException(Unknown Source)
  at org.hsqldb.jdbc.Util.sqlException(Unknown Source)
  at org.hsqldb.jdbc.JDBCConnection.<init>(Unknown Source)
  at org.hsqldb.jdbc.JDBCDriver.getConnection(Unknown Source)
  at org.hsqldb.jdbc.JDBCDataSource.getConnection(Unknown Source)
  at org.hsqldb.jdbc.JDBCDataSource.getConnection(Unknown Source)
  at org.geotools.referencing.factory.epsg.DirectEpsgFactory.getConnection(DirectEpsgFactory.java:3210)
  at org.geotools.referencing.factory.epsg.DirectEpsgFactory.prepareStatement(DirectEpsgFactory.java:726)
  at org.geotools.referencing.factory.epsg.DirectEpsgFactory.createCoordinateReferenceSystem(DirectEpsgFactory.java:1887)
  ... 46 more
Caused by: org.hsqldb.HsqlException: Database lock acquisition failure: attempt to connect while db opening /closing
  at org.hsqldb.error.Error.error(Unknown Source)
  at org.hsqldb.error.Error.error(Unknown Source)
  at org.hsqldb.error.Error.error(Unknown Source)
  at org.hsqldb.DatabaseManager.getDatabase(Unknown Source)
  at org.hsqldb.DatabaseManager.newSession(Unknown Source)
  ... 53 more

Running org.vfny.geoserver.global.GeoserverDataDirectoryTest
Tests run: 3, Failures: 0, Errors: 0, Skipped: 0, Time elapsed: 1.812 sec
Running org.vfny.geoserver.global.xml.WriterHelperTest
Tests run: 3, Failures: 0, Errors: 0, Skipped: 0, Time elapsed: 0.002 sec
Running org.vfny.geoserver.util.ResponseUtilsTest
Tests run: 3, Failures: 0, Errors: 0, Skipped: 0, Time elapsed: 0.003 sec
Running org.vfny.geoserver.util.SLDValidatorTest
Tests run: 2, Failures: 0, Errors: 0, Skipped: 0, Time elapsed: 0.109 sec

Results :

Tests in error:
  testNadCon(org.vfny.geoserver.crs.OvverideTransformationsTest): Database failure while creating a 'CoordinateReferenceSystem' object for code "EPSG:4138".

Tests run: 589, Failures: 0, Errors: 1, Skipped: 1

[INFO] ------------------------------------------------------------------------
[INFO] Reactor Summary:
[INFO]
[INFO] GeoServer ......................................... SUCCESS [4.959s]
[INFO] Core Platform Module .............................. SUCCESS [7.612s]
[INFO] Open Web Service Module ........................... SUCCESS [17.061s]
[INFO] Main Module ....................................... FAILURE [2:46.160s]
[INFO] GeoServer Security Modules ........................ SKIPPED
[INFO] GeoServer JDBC Security Module .................... SKIPPED
[INFO] GeoServer LDAP Security Module .................... SKIPPED
[INFO] Web Coverage Service Module ....................... SKIPPED
[INFO] Web Coverage Service 1.0 Module ................... SKIPPED
[INFO] Web Coverage Service 1.1 Module ................... SKIPPED
[INFO] Web Coverage Service 2.0 Module ................... SKIPPED
[INFO] Web Feature Service Module ........................ SKIPPED
[INFO] Web Map Service Module ............................ SKIPPED
[INFO] KML support for GeoServer ......................... SKIPPED
[INFO] GeoWebCache (GWC) Module .......................... SKIPPED
[INFO] REST Support Module ............................... SKIPPED
[INFO] REST Configuration Service Module ................. SKIPPED
[INFO] GeoServer Web Modules ............................. SUCCESS [0.549s]
[INFO] Core UI Module .................................... SKIPPED
[INFO] WMS UI Module ..................................... SKIPPED
[INFO] GWC UI Module ..................................... SKIPPED
[INFO] WFS UI Module ..................................... SKIPPED
[INFO] Demoes Module ..................................... SKIPPED
[INFO] WCS UI Module ..................................... SKIPPED
[INFO] Security UI Modules ............................... SKIPPED
[INFO] Security UI Core Module ........................... SKIPPED
[INFO] Security UI JDBC Module ........................... SKIPPED
[INFO] Security UI LDAP Module ........................... SKIPPED
[INFO] Community Space ................................... SUCCESS [2.667s]
[INFO] Printing Module ................................... SKIPPED
[INFO] HTTP Proxy Extension .............................. SKIPPED
[INFO] GeoServer Web Application ......................... SKIPPED
[INFO] GeoServer Extensions .............................. SUCCESS [0.292s]
[INFO] Application Schema Support ........................ SUCCESS [0.384s]
[INFO] Application Schema Integration Test ............... SKIPPED
[INFO] Sample DataAccess Integration Test ................ SKIPPED
[INFO] ArcSDE DataStore Extension ........................ SKIPPED
[INFO] GeoSearch Index Module ............................ SKIPPED
[INFO] H2 DataStore Extension ............................ SKIPPED
[INFO] SQL Server DataStore Extension .................... SUCCESS [1.518s]
[INFO] Oracle DataStore Extension ........................ SUCCESS [1.033s]
[INFO] MySQL DataStore Extension ......................... SUCCESS [0.643s]
[INFO] DB2 DataStore Extension ........................... SUCCESS [1.270s]
[INFO] ImageMap Output Format ............................ SKIPPED
[INFO] ImageI/O-Ext GDAL Coverage Extension .............. SUCCESS [1.444s]
[INFO] JP2K Coverage Extension ........................... SUCCESS [0.603s]
[INFO] ogr2ogr Output Format ............................. SKIPPED
[INFO] Excel Output Format ............................... SKIPPED
[INFO] Validation Module ................................. SKIPPED
[INFO] Chart external graphics support ................... SUCCESS [1.487s]
[INFO] Feature Generalization Extension .................. SKIPPED
[INFO] Image Mosaic JDBC Extension ....................... SUCCESS [1.148s]
[INFO] OWS request flow controller ....................... SKIPPED
[INFO] Web Processing Service parent ..................... SUCCESS [0.418s]
[INFO] Web Processing Service Module ..................... SKIPPED
[INFO] Web Processing Service GUI ........................ SKIPPED
[INFO] GeoServer Layer Querying filter functions ......... SKIPPED
[INFO] Teradata DataStore Extension ...................... SKIPPED
[INFO] GeoServer Monitor Extensions ...................... SKIPPED
[INFO] Core Monitor Extension ............................ SKIPPED
[INFO] Monitor Hibernate Extension ....................... SKIPPED
[INFO] GeoServer Security Extension Modules .............. SKIPPED
[INFO] GeoServer CAS Security Module ..................... SKIPPED
[INFO] GeoServer Security Extension Web Modules .......... SKIPPED
[INFO] GeoServer CAS Security Web Module ................. SKIPPED
[INFO] XLST based WFS output format ...................... SKIPPED
[INFO] GeoServer INSPIRE Extensions ...................... SKIPPED
[INFO] GeoServer CSS Styling ............................. SKIPPED
[INFO] Catalog Services for the Web parent ............... SKIPPED
[INFO] Catalog Services for the Web interfaces ........... SKIPPED
[INFO] Catalog Services for the Web - Simple CatalogStore implementation SKIPPED
[INFO] Catalog Services for the Web core module .......... SKIPPED
[INFO] CSW UI Module ..................................... SKIPPED
[INFO] DXF output format ................................. SUCCESS [0.676s]
[INFO] DXF output format ................................. SKIPPED
[INFO] DXF WPS PPIO ...................................... SKIPPED
[INFO] GeoServer WCS 2.0 Earth Observation Extensions .... SUCCESS [0.380s]
[INFO] Web Coverage Service 2.0 Earth Observation extensions SKIPPED
[INFO] Web Coverage Service 2.0 Earth Observation GUI extension SKIPPED
[INFO] GeoServer libjpeg-turbo Module .................... SKIPPED
[INFO] GeoServer Data Importer ........................... SKIPPED
[INFO] Importer Core Module .............................. SKIPPED
[INFO] Importer REST Api Module .......................... SKIPPED
[INFO] Importer Berkley DB Persistence Module ............ SKIPPED
[INFO] Importer Web UI Module ............................ SKIPPED
[INFO] ------------------------------------------------------------------------
[INFO] BUILD FAILURE
[INFO] ------------------------------------------------------------------------
[INFO] Total time: 3:22.616s (Wall Clock)
[INFO] Finished at: Thu Nov 06 10:06:29 UTC 2014
[INFO] Final Memory: 36M/193M
[INFO] ------------------------------------------------------------------------
[ERROR] Failed to execute goal org.apache.maven.plugins:maven-surefire-plugin:2.12.3:test (default-test) on project gs-main: There are test failures.
[ERROR]
[ERROR] Please refer to <http://ares.opengeo.org/jenkins/job/geoserver-2.5.x/ws/src/main/target/surefire-reports&gt; for the individual test results.
[ERROR] -> [Help 1]
[ERROR]
[ERROR] To see the full stack trace of the errors, re-run Maven with the -e switch.
[ERROR] Re-run Maven using the -X switch to enable full debug logging.
[ERROR]
[ERROR] For more information about the errors and possible solutions, please read the following articles:
[ERROR] [Help 1] http://cwiki.apache.org/confluence/display/MAVEN/MojoFailureException
[ERROR]
[ERROR] After correcting the problems, you can resume the build with the command
[ERROR] mvn <goals> -rf :gs-main
Build step 'Invoke top-level Maven targets' marked build as failure

See <http://ares.opengeo.org/jenkins/job/geoserver-2.5.x/131/changes&gt;