[Geoserver-devel] Build failed in Jenkins: geoserver-master-app-schema-online #869

See <http://ares.boundlessgeo.com/jenkins/job/geoserver-master-app-schema-online/869/&gt;

------------------------------------------
Started by timer
Building in workspace <http://ares.boundlessgeo.com/jenkins/job/geoserver-master-app-schema-online/ws/&gt;
> git rev-parse --is-inside-work-tree # timeout=10
Fetching changes from the remote Git repository
> git config remote.origin.url git://github.com/geoserver/geoserver.git # timeout=10
Fetching upstream changes from git://github.com/geoserver/geoserver.git
> git --version # timeout=10
> git -c core.askpass=true fetch --tags --progress git://github.com/geoserver/geoserver.git +refs/heads/*:refs/remotes/origin/*
> git rev-parse origin/master^{commit} # timeout=10
Checking out Revision 3cb7415bce5fc83071d358125b3a4ad5bd0600e0 (origin/master)
> git config core.sparsecheckout # timeout=10
> git checkout -f 3cb7415bce5fc83071d358125b3a4ad5bd0600e0
> git rev-list 3cb7415bce5fc83071d358125b3a4ad5bd0600e0 # timeout=10
[geoserver-master-app-schema-online] $ /bin/sh -xe /tmp/hudson7420141849089574365.sh
+ mkdir /var/lib/jenkins/.geotools
mkdir: cannot create directory `/var/lib/jenkins/.geotools': File exists
+ true
+ rm /var/lib/jenkins/.geotools/postgis.properties
rm: cannot remove `/var/lib/jenkins/.geotools/postgis.properties': No such file or directory
+ true
+ rm /var/lib/jenkins/.geotools/oracle.properties
rm: cannot remove `/var/lib/jenkins/.geotools/oracle.properties': No such file or directory
+ true
+ set +x
CREATE FUNCTION
CREATE FUNCTION
DELETE 0
INSERT 0 1
srid
------
4979
(1 row)

[geoserver-master-app-schema-online] $ /opt/apache-maven-3.3.9/bin/mvn -f src/extension/app-schema/pom.xml -B -Dtest.maxHeapSize=1024m -Dtest.maxPermSize=128m -fae -Papp-schema-online-test -pl !app-schema-oracle-test -Djava.io.tmpdir=/mnt/memtmp clean test
Java HotSpot(TM) 64-Bit Server VM warning: ignoring option MaxPermSize=256m; support was removed in 8.0
[INFO] Scanning for projects...
[INFO] ------------------------------------------------------------------------
[INFO] Reactor Build Order:
[INFO]
[INFO] Application Schema Support
[INFO] Application Schema Integration Test
[INFO] Sample DataAccess Integration Test
[INFO] Application Schema Integration Online Test with Postgis Database
[INFO] Application Schema MongoDB Integration Test
[INFO]
[INFO] ------------------------------------------------------------------------
[INFO] Building Application Schema Support 2.12-SNAPSHOT
[INFO] ------------------------------------------------------------------------
[INFO]
[INFO] --- maven-clean-plugin:2.5:clean (default-clean) @ gs-app-schema ---
[INFO]
[INFO] --- cobertura-maven-plugin:2.6:clean (default) @ gs-app-schema ---
[INFO] Skipping cobertura mojo for project with packaging type 'pom'
[INFO]
[INFO] --- git-commit-id-plugin:2.1.15:revision (default) @ gs-app-schema ---
[INFO]
[INFO] ------------------------------------------------------------------------
[INFO] Building Application Schema Integration Test 2.12-SNAPSHOT
[INFO] ------------------------------------------------------------------------
[INFO] Downloading: https://repo.boundlessgeo.com/main/org/geotools/gt-coverage/18-SNAPSHOT/gt-coverage-18-20170804.161834-258.pom
[INFO] Downloading: http://download.osgeo.org/webdav/geotools/org/geotools/gt-coverage/18-SNAPSHOT/gt-coverage-18-20170804.161834-258.pom
[INFO] Downloading: http://maven.geo-solutions.it/org/geotools/gt-coverage/18-SNAPSHOT/gt-coverage-18-20170804.161834-258.pom
[INFO]
[INFO] ------------------------------------------------------------------------
[INFO] Building Sample DataAccess Integration Test 2.12-SNAPSHOT
[INFO] ------------------------------------------------------------------------
[INFO] Downloading: https://repo.boundlessgeo.com/main/org/geotools/gt-coverage/18-SNAPSHOT/gt-coverage-18-20170804.161834-258.jar
[INFO]
[INFO] ------------------------------------------------------------------------
[INFO] Building Application Schema Integration Online Test with Postgis Database 2.12-SNAPSHOT
[INFO] ------------------------------------------------------------------------
[INFO]
[INFO] ------------------------------------------------------------------------
[INFO] Building Application Schema MongoDB Integration Test 2.12-SNAPSHOT
[INFO] ------------------------------------------------------------------------
[INFO] ------------------------------------------------------------------------
[INFO] Reactor Summary:
[INFO]
[INFO] Application Schema Support ......................... SUCCESS [ 5.554 s]
[INFO] Application Schema Integration Test ................ FAILURE [01:05 min]
[INFO] Sample DataAccess Integration Test ................. FAILURE [01:03 min]
[INFO] Application Schema Integration Online Test with Postgis Database FAILURE [ 0.143 s]
[INFO] Application Schema MongoDB Integration Test ........ FAILURE [ 0.129 s]
[INFO] ------------------------------------------------------------------------
[INFO] BUILD FAILURE
[INFO] ------------------------------------------------------------------------
[INFO] Total time: 02:15 min
[INFO] Finished at: 2017-08-05T20:42:20+00:00
[INFO] Final Memory: 50M/547M
[INFO] ------------------------------------------------------------------------
[ERROR] Failed to execute goal on project gs-app-schema-test: Could not resolve dependencies for project org.geoserver.extension:gs-app-schema-test:jar:2.12-SNAPSHOT: Failed to collect dependencies at org.geoserver:gs-main:jar:2.12-SNAPSHOT -> org.geoserver:gs-ows:jar:2.12-SNAPSHOT -> org.geotools.xsd:gt-xsd-ows:jar:18-SNAPSHOT -> org.geotools.xsd:gt-xsd-filter:jar:18-SNAPSHOT -> org.geotools:gt-coverage:jar:18-SNAPSHOT: Failed to read artifact descriptor for org.geotools:gt-coverage:jar:18-SNAPSHOT: Could not transfer artifact org.geotools:gt-coverage:pom:18-20170804.161834-258 from/to boundless (https://repo.boundlessgeo.com/main/): Connect to repo.boundlessgeo.com:443 [repo.boundlessgeo.com/52.22.156.115] failed: Connection timed out -> [Help 1]
[ERROR] Failed to execute goal on project gs-sample-data-access-test: Could not resolve dependencies for project org.geoserver.extension:gs-sample-data-access-test:jar:2.12-SNAPSHOT: Could not transfer artifact org.geotools:gt-coverage:jar:18-20170804.161834-258 from/to boundless (https://repo.boundlessgeo.com/main/): Connect to repo.boundlessgeo.com:443 [repo.boundlessgeo.com/52.22.156.115] failed: Connection timed out -> [Help 1]
[ERROR] Failed to execute goal on project gs-app-schema-postgis-test: Could not resolve dependencies for project org.geoserver.extension:gs-app-schema-postgis-test:jar:2.12-SNAPSHOT: Failure to transfer org.geotools:gt-coverage:jar:18-20170804.161834-258 from https://repo.boundlessgeo.com/main/ was cached in the local repository, resolution will not be reattempted until the update interval of boundless has elapsed or updates are forced. Original error: Could not transfer artifact org.geotools:gt-coverage:jar:18-20170804.161834-258 from/to boundless (https://repo.boundlessgeo.com/main/\): Connect to repo.boundlessgeo.com:443 [repo.boundlessgeo.com/52.22.156.115] failed: Connection timed out -> [Help 1]
[ERROR] Failed to execute goal on project gs-app-schema-mongo-test: Could not resolve dependencies for project org.geoserver.extension:gs-app-schema-mongo-test:jar:2.12-SNAPSHOT: Failure to transfer org.geotools:gt-coverage:jar:18-20170804.161834-258 from https://repo.boundlessgeo.com/main/ was cached in the local repository, resolution will not be reattempted until the update interval of boundless has elapsed or updates are forced. Original error: Could not transfer artifact org.geotools:gt-coverage:jar:18-20170804.161834-258 from/to boundless (https://repo.boundlessgeo.com/main/\): Connect to repo.boundlessgeo.com:443 [repo.boundlessgeo.com/52.22.156.115] failed: Connection timed out -> [Help 1]
[ERROR]
[ERROR] To see the full stack trace of the errors, re-run Maven with the -e switch.
[ERROR] Re-run Maven using the -X switch to enable full debug logging.
[ERROR]
[ERROR] For more information about the errors and possible solutions, please read the following articles:
[ERROR] [Help 1] http://cwiki.apache.org/confluence/display/MAVEN/DependencyResolutionException
[ERROR]
[ERROR] After correcting the problems, you can resume the build with the command
[ERROR] mvn <goals> -rf :gs-app-schema-test
Build step 'Invoke top-level Maven targets' marked build as failure

See <http://ares.boundlessgeo.com/jenkins/job/geoserver-master-app-schema-online/870/&gt;

------------------------------------------
Started by user Hudson
Building in workspace <http://ares.boundlessgeo.com/jenkins/job/geoserver-master-app-schema-online/ws/&gt;
> git rev-parse --is-inside-work-tree # timeout=10
Fetching changes from the remote Git repository
> git config remote.origin.url git://github.com/geoserver/geoserver.git # timeout=10
Fetching upstream changes from git://github.com/geoserver/geoserver.git
> git --version # timeout=10
> git -c core.askpass=true fetch --tags --progress git://github.com/geoserver/geoserver.git +refs/heads/*:refs/remotes/origin/*
> git rev-parse origin/master^{commit} # timeout=10
Checking out Revision 3cb7415bce5fc83071d358125b3a4ad5bd0600e0 (origin/master)
> git config core.sparsecheckout # timeout=10
> git checkout -f 3cb7415bce5fc83071d358125b3a4ad5bd0600e0
> git rev-list 3cb7415bce5fc83071d358125b3a4ad5bd0600e0 # timeout=10
[geoserver-master-app-schema-online] $ /bin/sh -xe /tmp/hudson1864500016417324249.sh
+ mkdir /var/lib/jenkins/.geotools
mkdir: cannot create directory `/var/lib/jenkins/.geotools': File exists
+ true
+ rm /var/lib/jenkins/.geotools/postgis.properties
rm: cannot remove `/var/lib/jenkins/.geotools/postgis.properties': No such file or directory
+ true
+ rm /var/lib/jenkins/.geotools/oracle.properties
rm: cannot remove `/var/lib/jenkins/.geotools/oracle.properties': No such file or directory
+ true
+ set +x
CREATE FUNCTION
CREATE FUNCTION
DELETE 1
INSERT 0 1
srid
------
4979
(1 row)

[geoserver-master-app-schema-online] $ /opt/apache-maven-3.3.9/bin/mvn -f src/extension/app-schema/pom.xml -B -Dtest.maxHeapSize=1024m -Dtest.maxPermSize=128m -fae -Papp-schema-online-test -pl !app-schema-oracle-test -Djava.io.tmpdir=/mnt/memtmp clean test
Java HotSpot(TM) 64-Bit Server VM warning: ignoring option MaxPermSize=256m; support was removed in 8.0
[INFO] Scanning for projects...
[INFO] ------------------------------------------------------------------------
[INFO] Reactor Build Order:
[INFO]
[INFO] Application Schema Support
[INFO] Application Schema Integration Test
[INFO] Sample DataAccess Integration Test
[INFO] Application Schema Integration Online Test with Postgis Database
[INFO] Application Schema MongoDB Integration Test
[INFO]
[INFO] ------------------------------------------------------------------------
[INFO] Building Application Schema Support 2.12-SNAPSHOT
[INFO] ------------------------------------------------------------------------
[INFO]
[INFO] --- maven-clean-plugin:2.5:clean (default-clean) @ gs-app-schema ---
[INFO]
[INFO] --- cobertura-maven-plugin:2.6:clean (default) @ gs-app-schema ---
[INFO] Skipping cobertura mojo for project with packaging type 'pom'
[INFO]
[INFO] --- git-commit-id-plugin:2.1.15:revision (default) @ gs-app-schema ---
[INFO]
[INFO] ------------------------------------------------------------------------
[INFO] Building Application Schema Integration Test 2.12-SNAPSHOT
[INFO] ------------------------------------------------------------------------
[INFO] Downloading: https://repo.boundlessgeo.com/main/org/geotools/gt-coverage/18-SNAPSHOT/gt-coverage-18-20170804.161834-258.pom
[INFO]
[INFO] ------------------------------------------------------------------------
[INFO] Building Sample DataAccess Integration Test 2.12-SNAPSHOT
[INFO] ------------------------------------------------------------------------
[INFO] Downloading: https://repo.boundlessgeo.com/main/org/geotools/gt-coverage/18-SNAPSHOT/gt-coverage-18-20170804.161834-258.jar
[INFO]
[INFO] ------------------------------------------------------------------------
[INFO] Building Application Schema Integration Online Test with Postgis Database 2.12-SNAPSHOT
[INFO] ------------------------------------------------------------------------
[INFO]
[INFO] ------------------------------------------------------------------------
[INFO] Building Application Schema MongoDB Integration Test 2.12-SNAPSHOT
[INFO] ------------------------------------------------------------------------
[INFO] ------------------------------------------------------------------------
[INFO] Reactor Summary:
[INFO]
[INFO] Application Schema Support ......................... SUCCESS [ 5.686 s]
[INFO] Application Schema Integration Test ................ FAILURE [01:04 min]
[INFO] Sample DataAccess Integration Test ................. FAILURE [01:03 min]
[INFO] Application Schema Integration Online Test with Postgis Database FAILURE [ 0.094 s]
[INFO] Application Schema MongoDB Integration Test ........ FAILURE [ 0.041 s]
[INFO] ------------------------------------------------------------------------
[INFO] BUILD FAILURE
[INFO] ------------------------------------------------------------------------
[INFO] Total time: 02:14 min
[INFO] Finished at: 2017-08-05T22:55:25+00:00
[INFO] Final Memory: 50M/528M
[INFO] ------------------------------------------------------------------------
[ERROR] Failed to execute goal on project gs-app-schema-test: Could not resolve dependencies for project org.geoserver.extension:gs-app-schema-test:jar:2.12-SNAPSHOT: Failed to collect dependencies at org.geoserver:gs-main:jar:2.12-SNAPSHOT -> org.geoserver:gs-ows:jar:2.12-SNAPSHOT -> org.geotools.xsd:gt-xsd-ows:jar:18-SNAPSHOT -> org.geotools.xsd:gt-xsd-filter:jar:18-SNAPSHOT -> org.geotools:gt-coverage:jar:18-SNAPSHOT: Failed to read artifact descriptor for org.geotools:gt-coverage:jar:18-SNAPSHOT: Could not transfer artifact org.geotools:gt-coverage:pom:18-20170804.161834-258 from/to boundless (https://repo.boundlessgeo.com/main/): Connect to repo.boundlessgeo.com:443 [repo.boundlessgeo.com/52.22.156.115] failed: Connection timed out -> [Help 1]
[ERROR] Failed to execute goal on project gs-sample-data-access-test: Could not resolve dependencies for project org.geoserver.extension:gs-sample-data-access-test:jar:2.12-SNAPSHOT: Could not transfer artifact org.geotools:gt-coverage:jar:18-20170804.161834-258 from/to boundless (https://repo.boundlessgeo.com/main/): Connect to repo.boundlessgeo.com:443 [repo.boundlessgeo.com/52.22.156.115] failed: Connection timed out -> [Help 1]
[ERROR] Failed to execute goal on project gs-app-schema-postgis-test: Could not resolve dependencies for project org.geoserver.extension:gs-app-schema-postgis-test:jar:2.12-SNAPSHOT: Failure to transfer org.geotools:gt-coverage:jar:18-20170804.161834-258 from https://repo.boundlessgeo.com/main/ was cached in the local repository, resolution will not be reattempted until the update interval of boundless has elapsed or updates are forced. Original error: Could not transfer artifact org.geotools:gt-coverage:jar:18-20170804.161834-258 from/to boundless (https://repo.boundlessgeo.com/main/\): Connect to repo.boundlessgeo.com:443 [repo.boundlessgeo.com/52.22.156.115] failed: Connection timed out -> [Help 1]
[ERROR] Failed to execute goal on project gs-app-schema-mongo-test: Could not resolve dependencies for project org.geoserver.extension:gs-app-schema-mongo-test:jar:2.12-SNAPSHOT: Failure to transfer org.geotools:gt-coverage:jar:18-20170804.161834-258 from https://repo.boundlessgeo.com/main/ was cached in the local repository, resolution will not be reattempted until the update interval of boundless has elapsed or updates are forced. Original error: Could not transfer artifact org.geotools:gt-coverage:jar:18-20170804.161834-258 from/to boundless (https://repo.boundlessgeo.com/main/\): Connect to repo.boundlessgeo.com:443 [repo.boundlessgeo.com/52.22.156.115] failed: Connection timed out -> [Help 1]
[ERROR]
[ERROR] To see the full stack trace of the errors, re-run Maven with the -e switch.
[ERROR] Re-run Maven using the -X switch to enable full debug logging.
[ERROR]
[ERROR] For more information about the errors and possible solutions, please read the following articles:
[ERROR] [Help 1] http://cwiki.apache.org/confluence/display/MAVEN/DependencyResolutionException
[ERROR]
[ERROR] After correcting the problems, you can resume the build with the command
[ERROR] mvn <goals> -rf :gs-app-schema-test
Build step 'Invoke top-level Maven targets' marked build as failure

See <http://ares.boundlessgeo.com/jenkins/job/geoserver-master-app-schema-online/871/changes&gt;